H2O..1,4-HO2C-C6H4-CO2 anion

Reaction thermochemistry data

Data compiled by: John E. Bartmess

Individual Reactions

C8H5O4-2 + Water = C8H7O5-

By formula: C8H5O4-2 + H2O = C8H7O5-

Quantity Value Units Method Reference Comment
Δr14.4 ± 1.5kcal/molTDAsBlades, Klassen, et al., 1995gas phase; T: 293 K. ΔSaff approx. 24 cal/mol-K
Quantity Value Units Method Reference Comment
Δr7.40 ± 0.30kcal/molTDAsBlades, Klassen, et al., 1995gas phase; T: 293 K. ΔSaff approx. 24 cal/mol-K

References

Blades, Klassen, et al., 1995
Blades, A.T.; Klassen, J.S.; Kebarle, P., Free Energies of Hydration in the Gas Phase on the Anions of Some Oxo Acids of C, N, S, P, Cl and I, J. Am. Chem. Soc., 1995, 117, 42, 10563, https://doi.org/10.1021/ja00147a019 . [all data]