H2O..HO2C(CH2)5CO2 anion

Reaction thermochemistry data

Data compiled by: John E. Bartmess

Individual Reactions

C7H11O4-2 + Water = C7H13O5-

By formula: C7H11O4-2 + H2O = C7H13O5-

Quantity Value Units Method Reference Comment
Δr23.0 ± 1.3kJ/molTDAsBlades, Klassen, et al., 1995gas phase

Ion clustering data

Data compiled by: John E. Bartmess

Clustering reactions

C7H11O4-2 + Water = C7H13O5-

By formula: C7H11O4-2 + H2O = C7H13O5-

Quantity Value Units Method Reference Comment
Δr23.0 ± 1.3kJ/molTDAsBlades, Klassen, et al., 1995gas phase

References

Blades, Klassen, et al., 1995
Blades, A.T.; Klassen, J.S.; Kebarle, P., Free Energies of Hydration in the Gas Phase on the Anions of Some Oxo Acids of C, N, S, P, Cl and I, J. Am. Chem. Soc., 1995, 117, 42, 10563, https://doi.org/10.1021/ja00147a019 . [all data]