H2O..(HO)HPO2 anion

Reaction thermochemistry data

Data compiled by: John E. Bartmess

Individual Reactions

CAS Reg. No. 15460-71-6 + Water = H4O4P-

By formula: CAS Reg. No. 15460-71-6 + H2O = H4O4P-

Quantity Value Units Method Reference Comment
Δr61.9 ± 6.3kJ/molTDAsBlades, Klassen, et al., 1995gas phase; T: 293 K. ΔSaff approx. 24 cal/mol-K
Quantity Value Units Method Reference Comment
Δr32.6 ± 1.3kJ/molTDAsBlades, Klassen, et al., 1995gas phase; T: 293 K. ΔSaff approx. 24 cal/mol-K

H4O4P- + 2Water = H6O5P-

By formula: H4O4P- + 2H2O = H6O5P-

Quantity Value Units Method Reference Comment
Δr56.9 ± 6.3kJ/molTDAsBlades, Klassen, et al., 1995gas phase; T: 293 K. ΔSaff approx. 24 cal/mol-K
Quantity Value Units Method Reference Comment
Δr27.6 ± 1.3kJ/molTDAsBlades, Klassen, et al., 1995gas phase; T: 293 K. ΔSaff approx. 24 cal/mol-K

Ion clustering data

Data compiled by: John E. Bartmess

Clustering reactions

H4O4P- + 2Water = H6O5P-

By formula: H4O4P- + 2H2O = H6O5P-

Quantity Value Units Method Reference Comment
Δr56.9 ± 6.3kJ/molTDAsBlades, Klassen, et al., 1995gas phase; T: 293 K. ΔSaff approx. 24 cal/mol-K
Quantity Value Units Method Reference Comment
Δr27.6 ± 1.3kJ/molTDAsBlades, Klassen, et al., 1995gas phase; T: 293 K. ΔSaff approx. 24 cal/mol-K

References

Blades, Klassen, et al., 1995
Blades, A.T.; Klassen, J.S.; Kebarle, P., Free Energies of Hydration in the Gas Phase on the Anions of Some Oxo Acids of C, N, S, P, Cl and I, J. Am. Chem. Soc., 1995, 117, 42, 10563, https://doi.org/10.1021/ja00147a019 . [all data]