Benzo[ghi]perylene anion

Gas phase thermochemistry data

Data compiled by: John E. Bartmess

Quantity Value Units Method Reference Comment
Δfgas261. ± 16.kJ/molR-EAChen and Cooks, 1995

References

Chen and Cooks, 1995
Chen, G.D.; Cooks, R.G., Electron affinities of polycyclic aromatic hydrocarbons determined by the kinetic method, J. Mass Spectrom., 1995, 30, 8, 1167, https://doi.org/10.1002/jms.1190300814 . [all data]