1,2-diCO2Me-cyclopropanide anion

Reaction thermochemistry data

Data compiled by: John E. Bartmess

Individual Reactions

C7H9O4- + Hydrogen cation = C7H10O4

By formula: C7H9O4- + H+ = C7H10O4

Quantity Value Units Method Reference Comment
Δr1569. ± 15.kJ/molG+TSChou, Dahlke, et al., 1993gas phase
Quantity Value Units Method Reference Comment
Δr1535. ± 15.kJ/molIMRBChou, Dahlke, et al., 1993gas phase

Gas phase ion energetics data

Data compiled by: John E. Bartmess

Protonation reactions

C7H9O4- + Hydrogen cation = C7H10O4

By formula: C7H9O4- + H+ = C7H10O4

Quantity Value Units Method Reference Comment
Δr1569. ± 15.kJ/molG+TSChou, Dahlke, et al., 1993gas phase
Quantity Value Units Method Reference Comment
Δr1535. ± 15.kJ/molIMRBChou, Dahlke, et al., 1993gas phase

References

Chou, Dahlke, et al., 1993
Chou, P.K.; Dahlke, G.D.; Kass, S.R., Unimolecular Rearrangements of Carbanions in the Gas Phase .2. Cyclopropyl Anions, J. Chem. Soc. Chem. Comm., 1993, 115, 1, 315, https://doi.org/10.1021/ja00054a045 . [all data]