1-CHO-cyclopropanide anion

Reaction thermochemistry data

Data compiled by: John E. Bartmess

Individual Reactions

C4H5O- + Hydrogen cation = Cyclopropanecarboxaldehyde

By formula: C4H5O- + H+ = C4H6O

Quantity Value Units Method Reference Comment
Δr1572. ± 8.8kJ/molG+TSChou, Dahlke, et al., 1993gas phase; barrier for opening to CH2=C(CHO)CH2-: 29 kcal/mol.
Quantity Value Units Method Reference Comment
Δr1543. ± 8.4kJ/molIMREChou, Dahlke, et al., 1993gas phase; barrier for opening to CH2=C(CHO)CH2-: 29 kcal/mol.

Gas phase ion energetics data

Data compiled by: John E. Bartmess

Protonation reactions

C4H5O- + Hydrogen cation = Cyclopropanecarboxaldehyde

By formula: C4H5O- + H+ = C4H6O

Quantity Value Units Method Reference Comment
Δr1572. ± 8.8kJ/molG+TSChou, Dahlke, et al., 1993gas phase; barrier for opening to CH2=C(CHO)CH2-: 29 kcal/mol.
Quantity Value Units Method Reference Comment
Δr1543. ± 8.4kJ/molIMREChou, Dahlke, et al., 1993gas phase; barrier for opening to CH2=C(CHO)CH2-: 29 kcal/mol.

References

Chou, Dahlke, et al., 1993
Chou, P.K.; Dahlke, G.D.; Kass, S.R., Unimolecular Rearrangements of Carbanions in the Gas Phase .2. Cyclopropyl Anions, J. Chem. Soc. Chem. Comm., 1993, 115, 1, 315, https://doi.org/10.1021/ja00054a045 . [all data]