HN=SiHO anion

Gas phase ion energetics data

Data compiled by: John E. Bartmess

Protonation reactions

H2NOSi- + Hydrogen cation = H3NOSi

By formula: H2NOSi- + H+ = H3NOSi

Quantity Value Units Method Reference Comment
Δr359.5 ± 4.2kcal/molG+TSHankin, Krempp, et al., 1995gas phase; Between CF3CH2OH,MeSH, but poor thresholds due to competeting reactions.
Quantity Value Units Method Reference Comment
Δr352.3 ± 4.0kcal/molIMRBHankin, Krempp, et al., 1995gas phase; Between CF3CH2OH,MeSH, but poor thresholds due to competeting reactions.

References

Hankin, Krempp, et al., 1995
Hankin, J.A.; Krempp, M.; Damrauer, R., Gas-phase Chemistry of the Silaformamide Ion, Organomet., 1995, 14, 6, 2652, https://doi.org/10.1021/om00006a011 . [all data]