C60F2 radical anion

Gas phase ion energetics data

Data compiled by: John E. Bartmess

Electron affinity of neutral species

EAneutral (eV) Method Reference Comment
2.740 ± 0.070IMREBoltalina, Sidorov, et al., 1994ΔGea = 1.4 kcal/mol > C60

References

Boltalina, Sidorov, et al., 1994
Boltalina, O.V.; Sidorov, L.N.; Sukhanova, E.V.; Sorokin, I.D., Observation of difluorinated higher fullerene anions by Knudsen cell mass spectrometry and determination of electron affinities of C60F2 and, Chem. Phys. Lett., 1994, 230, 6, 567, https://doi.org/10.1016/0009-2614(94)01204-0 . [all data]