(CrO3)2 radical anion

Gas phase ion energetics data

Data compiled by: John E. Bartmess

Electron affinity of neutral species

EAneutral (eV) Method Reference Comment
4.250 ± 0.050LPESZhai, Li, et al., 2008Vertical Detachment Energy: 4.45±0.05 eV
1.60 ± 0.30EIAEWang, Margrave, et al., 1975From (CrO3)3

References

Zhai, Li, et al., 2008
Zhai, H.J.; Li, S.; Dixon, D.A.; Wang, L.S., Probing the electronic and structural properties of chromium oxide clusters (CrO3)(n)(-) and (CrO3)(n) (n=1-5): Photoelectron Spectroscopy and density functional calculations, J. Am. Chem. Soc., 2008, 130, 15, 5167-5177, https://doi.org/10.1021/ja077984d . [all data]

Wang, Margrave, et al., 1975
Wang, J.L.-F.; Margrave, J.L.; Franklin, J.L., Low energy electron attachment to gaseous chromium oxides, J. Inorg. Nucl. Chem., 1975, 37, 1107. [all data]