Fe19 anion
- Formula: Fe19-
- Molecular weight: 1061.056

Gas phase ion energetics data

Data compiled by: John E. Bartmess
Electron affinity of neutral species
EAneutral (eV) | Method | Reference | Comment |
---|---|---|---|
2.010 ± 0.080 | LPES | Wang, Cheng, et al., 1995 | |
2.110 ± 0.060 | LPES | Wang, Li, et al., 2000 |

References

Wang, Cheng, et al., 1995
Wang, L.S.; Cheng, H.S.; Fan, J.W.,
Photoelectron spectroscopy of size-selected transition metal clusters: Fe-n(-),
J. Chem. Phys., 1995, 102, 24, 9480, https://doi.org/10.1063/1.468817
. [all data]
Wang, Li, et al., 2000
Wang, L.S.; Li, X.; Zhang, H.F.,
Probing the electronic structure of iron clusters using photoelectron spectroscopy,
Chem. Phys., 2000, 262, 1, 53-63, https://doi.org/10.1016/S0301-0104(00)00351-7
. [all data]