C90 anion

Gas phase ion energetics data

Data compiled by: John E. Bartmess

Electron affinity of neutral species

EAneutral (eV) Method Reference Comment
>2.99997IMRBBoltalina, Sidorov, et al., 1993Lower limit. Observed, but not enough neutral pressure to quantitate.

References

Boltalina, Sidorov, et al., 1993
Boltalina, O.V.; Sidorov, L.N.; Borshchevsky, A.Y.; Sukhanova, E.V.; Skokan, E.V., Electron Affinities of Higher Fullerenes, Rapid Commun. Mass Spectrom., 1993, 7, 11, 1009, https://doi.org/10.1002/rcm.1290071109 . [all data]