Al4S3 anion

Gas phase ion energetics data

Data compiled by: John E. Bartmess

Electron affinity of neutral species

EAneutral (eV) Method Reference Comment
2.360 ± 0.070LPESNakajima, Zhang, et al., 1995

References

Nakajima, Zhang, et al., 1995
Nakajima, A.; Zhang, N.; Kawamata, H.; Hayase, T.; Nakao, K.; Kaya, K., Photoelectron spectroscopy and mass distributions of aluminum-sulfur cluster anions (AlnSm-), Chem. Phys. Lett., 1995, 241, 4, 295, https://doi.org/10.1016/0009-2614(95)00653-L . [all data]