AlS2 anion

Gas phase thermochemistry data

Data compiled by: John E. Bartmess

Quantity Value Units Method Reference Comment
Δfgas<-201.0kJ/molR-EANakajima, Zhang, et al., 1995

References

Nakajima, Zhang, et al., 1995
Nakajima, A.; Zhang, N.; Kawamata, H.; Hayase, T.; Nakao, K.; Kaya, K., Photoelectron spectroscopy and mass distributions of aluminum-sulfur cluster anions (AlnSm-), Chem. Phys. Lett., 1995, 241, 4, 295, https://doi.org/10.1016/0009-2614(95)00653-L . [all data]