In3P2 radical anion

Gas phase ion energetics data

Data compiled by: John E. Bartmess

Electron affinity of neutral species

EAneutral (eV) Method Reference Comment
2.070 ± 0.050LPESXu, Debeer, et al., 1994
2.74 ± 0.10LPESAsmis, Taylor, et al., 1999Vertical Detachment Energy: 3.06±0.10 eV.

References

Xu, Debeer, et al., 1994
Xu, C.S.; Debeer, E.; Arnold, D.W.; Arnold, C.C.; Neumark, D.M., Anion photoelectron spectroscopy of small indium phosphide clusters (InxPy(-);x,y=1-4), J. Chem. Phys., 1994, 101, 6, 5406, https://doi.org/10.1063/1.467393 . [all data]

Asmis, Taylor, et al., 1999
Asmis, K.R.; Taylor, T.R.; Neumark, D.M., Electronic structure of indium phosphide clusters: anion photoelectron spectroscopy of InxPx- and Inx+1Px- (x=1-13) clusters, Chem. Phys. Lett., 1999, 308, 5-6, 347-354, https://doi.org/10.1016/S0009-2614(99)00671-5 . [all data]