Titanium tetrachloride anion

Gas phase thermochemistry data

Data compiled by: John E. Bartmess

Quantity Value Units Method Reference Comment
Δfgas-248.8 ± 3.5kcal/molR-EAMathur, Rothe, et al., 1979

References

Mathur, Rothe, et al., 1979
Mathur, E.P.; Rothe, E.W.; Reck, G.P., Negative ions from the reactions of alkalis with SnCl4, GeCl4, and TiCl4, Int. J. Mass Spectrom. Ion Phys., 1979, 31, 77. [all data]