Pt2 anion

Gas phase thermochemistry data

Data compiled by: John E. Bartmess

Quantity Value Units Method Reference Comment
Δfgas154.0 ± 1.4kcal/molR-EAHo, Polak, et al., 1993

References

Ho, Polak, et al., 1993
Ho, J.; Polak, M.L.; Ervin, K.M.; Lineberger, W.C., Photoelectron Spectroscopy of Nickel Group Dimers - Ni2(-), Pd2(-), and Pt2(-), J. Chem. Phys., 1993, 99, 11, 8542, https://doi.org/10.1063/1.465577 . [all data]