(CO2)2..Br anion

Gas phase thermochemistry data

Data compiled by: John E. Bartmess

Quantity Value Units Method Reference Comment
Δfgas-1043. ± 12.kJ/molTherArnold, Bradforth, et al., 1995EA given is Vertical Detachment Energy. Affinity: difference between successive EAs in (Y)
Δfgas-1047. ± 9.6kJ/molTherHiraoka, Mizuse, et al., 1987

References

Arnold, Bradforth, et al., 1995
Arnold, D.W.; Bradforth, S.E.; Kim, E.H.; Neumark, D.M., Study of I-(CO2)n, Br-(CO2)n, and I-(N2O)n clusters by anion photoelectron spectroscopy, J. Chem. Phys., 1995, 102, 9, 3510, https://doi.org/10.1063/1.468576 . [all data]

Hiraoka, Mizuse, et al., 1987
Hiraoka, K.; Mizuse, S.; Yamabe, S., Stability and Structure of Cluster Ions: Halide Ions with CO2, J. Chem. Phys., 1987, 87, 6, 3647, https://doi.org/10.1063/1.452962 . [all data]