(N2O)11..I anion

Gas phase thermochemistry data

Data compiled by: John E. Bartmess

Quantity Value Units Method Reference Comment
Δfgas143.9 ± 6.7kcal/molTherArnold, Bradforth, et al., 1995EA given is Vertical Detachment Energy. Affinity: difference between successive EAs in (Y)

Gas phase ion energetics data

Data compiled by: John E. Bartmess

Electron affinity of neutral species

EAneutral (eV) Method Reference Comment
4.165 ± 0.035LPESArnold, Bradforth, et al., 1995EA given is Vertical Detachment Energy. Affinity: difference between successive EAs in (Y)

References

Arnold, Bradforth, et al., 1995
Arnold, D.W.; Bradforth, S.E.; Kim, E.H.; Neumark, D.M., Study of I-(CO2)n, Br-(CO2)n, and I-(N2O)n clusters by anion photoelectron spectroscopy, J. Chem. Phys., 1995, 102, 9, 3510, https://doi.org/10.1063/1.468576 . [all data]