mBr-phenide anion

Gas phase ion energetics data

Data compiled by: John E. Bartmess

Protonation reactions

C6H4Br- + Hydrogen cation = Benzene, bromo-

By formula: C6H4Br- + H+ = C6H5Br

Quantity Value Units Method Reference Comment
Δr383.5 ± 2.1kcal/molBranWenthold and Squires, 1995gas phase; By HO- cleavage of substituted silanes
Quantity Value Units Method Reference Comment
Δr375.3 ± 2.2kcal/molH-TSWenthold and Squires, 1995gas phase; By HO- cleavage of substituted silanes

References

Wenthold and Squires, 1995
Wenthold, P.G.; Squires, R.R., Determination of the gas-phase acidities of halogen-substituted aromatic compounds using the silane-cleavage method, J. Mass Spectrom., 1995, 30, 1, 17, https://doi.org/10.1002/jms.1190300105 . [all data]