mF-phenide anion

Reaction thermochemistry data

Data compiled by: John E. Bartmess

Individual Reactions

C6H4F- + Hydrogen cation = Benzene, fluoro-

By formula: C6H4F- + H+ = C6H5F

Quantity Value Units Method Reference Comment
Δr1654. ± 8.4kJ/molBranWenthold and Squires, 1995gas phase; By HO- cleavage of substituted silanes
Quantity Value Units Method Reference Comment
Δr1619. ± 8.8kJ/molH-TSWenthold and Squires, 1995gas phase; By HO- cleavage of substituted silanes

Gas phase ion energetics data

Data compiled by: John E. Bartmess

Electron affinity of neutral species

EAneutral (eV) Method Reference Comment
1.383 ± 0.097D-EAWenthold and Squires, 1995By HO- cleavage of substituted silanes

Protonation reactions

C6H4F- + Hydrogen cation = Benzene, fluoro-

By formula: C6H4F- + H+ = C6H5F

Quantity Value Units Method Reference Comment
Δr1654. ± 8.4kJ/molBranWenthold and Squires, 1995gas phase; By HO- cleavage of substituted silanes
Quantity Value Units Method Reference Comment
Δr1619. ± 8.8kJ/molH-TSWenthold and Squires, 1995gas phase; By HO- cleavage of substituted silanes

References

Wenthold and Squires, 1995
Wenthold, P.G.; Squires, R.R., Determination of the gas-phase acidities of halogen-substituted aromatic compounds using the silane-cleavage method, J. Mass Spectrom., 1995, 30, 1, 17, https://doi.org/10.1002/jms.1190300105 . [all data]