Argon hydride

Constants of diatomic molecules

Data compiled by: Klaus P. Huber and Gerhard H. Herzberg

Data collected through January, 1976

Symbols used in the table of constants
SymbolMeaning
State electronic state and / or symmetry symbol
Te minimum electronic energy (cm-1)
ωe vibrational constant – first term (cm-1)
ωexe vibrational constant – second term (cm-1)
ωeye vibrational constant – third term (cm-1)
Be rotational constant in equilibrium position (cm-1)
αe rotational constant – first term (cm-1)
γe rotation-vibration interaction constant (cm-1)
De centrifugal distortion constant (cm-1)
βe rotational constant – first term, centrifugal force (cm-1)
re internuclear distance (Å)
Trans. observed transition(s) corresponding to electronic state
ν00 position of 0-0 band (units noted in table)
Diatomic constants for 40ArH
StateTeωeωexeωeyeBeαeγeDeβereTrans.ν00
B 2Π 1    [10.129] 2   [0.000503]  [1.3012] B → A 3 R 13024.5 Z
missing citation
A 2Σ+     [10.200] 4   [0.000531]  [1.2966]
For a theoretical calculation of the ground state potential (De = 0.0042 eV, re = 3.57 Å) and a comparison with experimental scattering data see Wagner, Das, et al., 1974.

References

Wagner, Das, et al., 1974
Wagner, A.F.; Das, G.; Wahl, A.C., Calculated long-range interactions and low energy scattering of Ar-H, J. Chem. Phys., 1974, 60, 1885. [all data]

Johns, 1970
Johns, J.W.C., A spectrum of neutral argon hydride, J. Mol. Spectrosc., 1970, 36, 488. [all data]