Ar..O radical anion

Gas phase ion energetics data

Data compiled by: John E. Bartmess

Electron affinity of neutral species

EAneutral (eV) Method Reference Comment
1.54745 ± 0.00025N/AGarand, Buchachenko, et al., 2009
1.562 ± 0.035LPESArnold, Hendricks, et al., 1995EA given is Vertical Detachment Energy. Affinity: difference between successive EAs in (Y)

References

Garand, Buchachenko, et al., 2009
Garand, E.; Buchachenko, A.A.; Yacovitch, T.I.; Szczesniak, M.M.; Chalasinski, G.; Neumark, D.M., Study of ArO- and ArO via Slow Photoelectron Velocity-Map Imaging Spectroscopy and Ab Initio Calculations, J. Phys. Chem. A, 2009, 113, 16, 4631-4638, https://doi.org/10.1021/jp8113682 . [all data]

Arnold, Hendricks, et al., 1995
Arnold, S.T.; Hendricks, J.H.; Bowen, K.H., Photoelectron spectroscopy of the solvated anion clusters O-(Ar)(n=1-26,34): Energetics and structure, J. Chem. Phys., 1995, 102, 1, 39, https://doi.org/10.1063/1.469415 . [all data]