MeOSiH2NH anion

Gas phase ion energetics data

Data compiled by: John E. Bartmess

Protonation reactions

CH6NOSi- + Hydrogen cation = CH7NOSi

By formula: CH6NOSi- + H+ = CH7NOSi

Quantity Value Units Method Reference Comment
Δr375.5 ± 3.1kcal/molG+TSKrempp and Damrauer, 1995gas phase; Acidity between EtCN, nPrOH
Quantity Value Units Method Reference Comment
Δr368.0 ± 3.0kcal/molIMRBKrempp and Damrauer, 1995gas phase; Acidity between EtCN, nPrOH

References

Krempp and Damrauer, 1995
Krempp, M.; Damrauer, R., The Gas-phase Chemistry of Silamide Ions, Organomet., 1995, 14, 1, 170, https://doi.org/10.1021/om00001a027 . [all data]