PhSiH2NH anion

Reaction thermochemistry data

Data compiled by: John E. Bartmess

Individual Reactions

C6H8NSi- + Hydrogen cation = C6H9NSi

By formula: C6H8NSi- + H+ = C6H9NSi

Quantity Value Units Method Reference Comment
Δr1563. ± 13.kJ/molG+TSKrempp and Damrauer, 1995gas phase; Acidity between MeCN, nHxOH
Quantity Value Units Method Reference Comment
Δr1531. ± 13.kJ/molIMRBKrempp and Damrauer, 1995gas phase; Acidity between MeCN, nHxOH

Gas phase ion energetics data

Data compiled by: John E. Bartmess

Protonation reactions

C6H8NSi- + Hydrogen cation = C6H9NSi

By formula: C6H8NSi- + H+ = C6H9NSi

Quantity Value Units Method Reference Comment
Δr373.5 ± 3.1kcal/molG+TSKrempp and Damrauer, 1995gas phase; Acidity between MeCN, nHxOH
Quantity Value Units Method Reference Comment
Δr366.0 ± 3.0kcal/molIMRBKrempp and Damrauer, 1995gas phase; Acidity between MeCN, nHxOH

References

Krempp and Damrauer, 1995
Krempp, M.; Damrauer, R., The Gas-phase Chemistry of Silamide Ions, Organomet., 1995, 14, 1, 170, https://doi.org/10.1021/om00001a027 . [all data]