H3SiNH anion

Gas phase ion energetics data

Data compiled by: John E. Bartmess

Protonation reactions

H4NSi- + Hydrogen cation = H5NSi

By formula: H4NSi- + H+ = H5NSi

Quantity Value Units Method Reference Comment
Δr375.5 ± 3.1kcal/molG+TSKrempp and Damrauer, 1995gas phase; Acidity between EtCN, nBuOH
Quantity Value Units Method Reference Comment
Δr368.0 ± 3.0kcal/molIMRBKrempp and Damrauer, 1995gas phase; Acidity between EtCN, nBuOH

References

Krempp and Damrauer, 1995
Krempp, M.; Damrauer, R., The Gas-phase Chemistry of Silamide Ions, Organomet., 1995, 14, 1, 170, https://doi.org/10.1021/om00001a027 . [all data]