1,2,3-triphenyl-cyclopropenide anion

Gas phase ion energetics data

Data compiled by: John E. Bartmess

Electron affinity of neutral species

EAneutral (eV) Method Reference Comment
0.57 ± 0.24D-EABartmess, Kester, et al., 1986Between H2O, MeOH

Protonation reactions

C21H15- + Hydrogen cation = Triphenylcyclopropene

By formula: C21H15- + H+ = C21H16

Quantity Value Units Method Reference Comment
Δr1613. ± 21.kJ/molG+TSBartmess, Kester, et al., 1986gas phase; Between H2O, MeOH
Quantity Value Units Method Reference Comment
Δr1577. ± 21.kJ/molIMRBBartmess, Kester, et al., 1986gas phase; Between H2O, MeOH

References

Bartmess, Kester, et al., 1986
Bartmess, J.E.; Kester, J.; Borden, W.T.; Köser, H.G., Triphenylcyclopropenide Anion in the Gas Phase, Tetrahed. Lett., 1986, 27, 49, 5931, https://doi.org/10.1016/S0040-4039(00)85365-4 . [all data]