nC4F9SO2N=C(CF3)O anion

Reaction thermochemistry data

Data compiled by: John E. Bartmess

Individual Reactions

C6F12NO3S- + Hydrogen cation = C6HF12NO3S

By formula: C6F12NO3S- + H+ = C6HF12NO3S

Quantity Value Units Method Reference Comment
Δr1242. ± 8.4kJ/molIMREKoppel, Taft, et al., 1994gas phase; Per Leito, Raamat, et al., 2009, dGacid is likely too weak by at least 1.3 kcal/mol, and possibly 5.3, due to problems in the ladder at dGacid=299

Gas phase ion energetics data

Data compiled by: John E. Bartmess

Protonation reactions

C6F12NO3S- + Hydrogen cation = C6HF12NO3S

By formula: C6F12NO3S- + H+ = C6HF12NO3S

Quantity Value Units Method Reference Comment
Δr1242. ± 8.4kJ/molIMREKoppel, Taft, et al., 1994gas phase; Per Leito, Raamat, et al., 2009, dGacid is likely too weak by at least 1.3 kcal/mol, and possibly 5.3, due to problems in the ladder at dGacid=299

References

Koppel, Taft, et al., 1994
Koppel, I.A.; Taft, R.W.; Anvia, F.; Zhu, S.Z.; Hu, L.Q.; Sung, K.S.; Desmarteau, D.D.; Yagupolskii, L.M., The Gas-Phase Acidities of Very Strong Neutral Bronsted Acids, J. Am. Chem. Soc., 1994, 116, 7, 3047, https://doi.org/10.1021/ja00086a038 . [all data]

Leito, Raamat, et al., 2009
Leito, I.; Raamat, E.; Kutt, A.; Saame, J.; Kipper, K.; Koppel, I.A.; Koppel, I.; Zhang, M.; Mishima, M.; Yagupolskii, L.M.; Garlyauskayte, R.Y.; Filatov, A.A., Revision of the Gas-Phase Acidity Scale below 300 kcal mol(-1), J. Phys. Chem. A, 2009, 113, 29, 8421-8424, https://doi.org/10.1021/jp903780k . [all data]