2,4-diNO2-phenoxide anion

Reaction thermochemistry data

Data compiled by: John E. Bartmess

Individual Reactions

C6H3N2O5- + Hydrogen cation = Phenol, 2,4-dinitro-

By formula: C6H3N2O5- + H+ = C6H4N2O5

Quantity Value Units Method Reference Comment
Δr1322. ± 8.8kJ/molG+TSKoppel, Taft, et al., 1994gas phase
Quantity Value Units Method Reference Comment
Δr1291. ± 8.4kJ/molIMREKoppel, Taft, et al., 1994gas phase

Gas phase ion energetics data

Data compiled by: John E. Bartmess

Protonation reactions

C6H3N2O5- + Hydrogen cation = Phenol, 2,4-dinitro-

By formula: C6H3N2O5- + H+ = C6H4N2O5

Quantity Value Units Method Reference Comment
Δr1322. ± 8.8kJ/molG+TSKoppel, Taft, et al., 1994gas phase
Quantity Value Units Method Reference Comment
Δr1291. ± 8.4kJ/molIMREKoppel, Taft, et al., 1994gas phase

References

Koppel, Taft, et al., 1994
Koppel, I.A.; Taft, R.W.; Anvia, F.; Zhu, S.Z.; Hu, L.Q.; Sung, K.S.; Desmarteau, D.D.; Yagupolskii, L.M., The Gas-Phase Acidities of Very Strong Neutral Bronsted Acids, J. Am. Chem. Soc., 1994, 116, 7, 3047, https://doi.org/10.1021/ja00086a038 . [all data]