(C6F5)2CCN anion

Gas phase ion energetics data

Data compiled by: John E. Bartmess

Protonation reactions

C14F10N- + Hydrogen cation = C14HF10N

By formula: C14F10N- + H+ = C14HF10N

Quantity Value Units Method Reference Comment
Δr1307. ± 8.4kJ/molIMREKoppel, Taft, et al., 1994gas phase

References

Koppel, Taft, et al., 1994
Koppel, I.A.; Taft, R.W.; Anvia, F.; Zhu, S.Z.; Hu, L.Q.; Sung, K.S.; Desmarteau, D.D.; Yagupolskii, L.M., The Gas-Phase Acidities of Very Strong Neutral Bronsted Acids, J. Am. Chem. Soc., 1994, 116, 7, 3047, https://doi.org/10.1021/ja00086a038 . [all data]