CF3SO2N(CH2Ph) anion

Gas phase ion energetics data

Data compiled by: John E. Bartmess

Protonation reactions

C8H7F3NO2S- + Hydrogen cation = N-benzyl-1,1,1-trifluoromethanesulphonamide

By formula: C8H7F3NO2S- + H+ = C8H8F3NO2S

Quantity Value Units Method Reference Comment
Δr318.8 ± 2.0kcal/molIMREKoppel, Taft, et al., 1994gas phase

References

Koppel, Taft, et al., 1994
Koppel, I.A.; Taft, R.W.; Anvia, F.; Zhu, S.Z.; Hu, L.Q.; Sung, K.S.; Desmarteau, D.D.; Yagupolskii, L.M., The Gas-Phase Acidities of Very Strong Neutral Bronsted Acids, J. Am. Chem. Soc., 1994, 116, 7, 3047, https://doi.org/10.1021/ja00086a038 . [all data]