MeBr..I anion

Gas phase thermochemistry data

Data compiled by: John E. Bartmess

Quantity Value Units Method Reference Comment
Δfgas-261.2 ± 2.5kJ/molTherCyr, Bishea, et al., 1992

Gas phase ion energetics data

Data compiled by: John E. Bartmess

Electron affinity of neutral species

EAneutral (eV) Method Reference Comment
3.420 ± 0.010LPESVan Duzor, Wei, et al., 2010

References

Cyr, Bishea, et al., 1992
Cyr, D.M.; Bishea, G.A.; Scarton, M.G.; Johnson, M.A., Observation of Charge-Transfer Excited States in the I-.CH3I, I-.CH3Br, and I-.CH2Br2 S(N)2 Reaction Intermediates Using Photofragmentation, J. Chem. Phys., 1992, 97, 8, 5911, https://doi.org/10.1063/1.463752 . [all data]