Sb4 anion

Gas phase thermochemistry data

Data compiled by: John E. Bartmess

Quantity Value Units Method Reference Comment
Δfgas>108. ± 13.kJ/molR-EAPolak, Gerber, et al., 1992Vertical Detachment Energy: 1.57±0.05 eV.

References

Polak, Gerber, et al., 1992
Polak, M.L.; Gerber, G.; Ho, J.; Lineberger, W.C., Photoelectron Spectroscopy of Small Antimony Cluster Anions - Sb(-) Sb2(-), Sb3(-), and Sb4(-), J. Chem. Phys., 1992, 97, 12, 8990, https://doi.org/10.1063/1.463326 . [all data]