CH3CD2O anion

Reaction thermochemistry data

Data compiled by: John E. Bartmess

Individual Reactions

C2H3D5O- + Hydrogen cation = Ethanol-1,1-d2

By formula: C2H3D5O- + H+ = C2H4D2O

Quantity Value Units Method Reference Comment
Δr377.7 ± 2.2kcal/molG+TSDang, Motell, et al., 1993gas phase; Acidity 0.35±0.15 weaker than CH3CH2OH
Quantity Value Units Method Reference Comment
Δr371.1 ± 2.1kcal/molCIDCDang, Motell, et al., 1993gas phase; Acidity 0.35±0.15 weaker than CH3CH2OH

References

Dang, Motell, et al., 1993
Dang, T.T.; Motell, E.L.; Travers, M.J.; Clifford, E.P.; Ellison, G.B.; Depuy, C.H.; Bierbaum, V.M., Experimental and Computational Studies of Deuterated Ethanols - Gas-Phase Acidities, Electron Affinities and Bond Dissociation Energies, Int. J. Mass Spectrom. Ion Proc., 1993, 123, 3, 171, https://doi.org/10.1016/0168-1176(93)87096-B . [all data]