AlClF2..Cl anion

Gas phase thermochemistry data

Data compiled by: John E. Bartmess

Quantity Value Units Method Reference Comment
Δfgas-1538. ± 13.kJ/molTherPervova, Korobov, et al., 1992Thermo at 0K, experiments at 800-1100K. See also AlCl2F..F-; value altered from reference due to conversion from electron convention to ion convention

References

Pervova, Korobov, et al., 1992
Pervova, Y.U.; Korobov, M.V.; Sidorov, L.N., Enthalpies of Bonds Rupture in AlClnF4-n(-) Anions, Russ. J. Phys. Chem., 1992, 66, 635. [all data]