Sn5 anion

Gas phase ion energetics data

Data compiled by: John E. Bartmess

Electron affinity of neutral species

EAneutral (eV) Method Reference Comment
2.650 ± 0.010LPESMoravec, Klopcic, et al., 1999Vertical Detachment Energy: 2.85 eV
2.51 ± 0.32LPESNegishi, Kawamata, et al., 2000EA is threshold energy, upper limit to true EA
2.20 ± 0.20LPESGanteför, Gausa, et al., 1989EA: sharp threshold, ≤EA(adiabatic).

References

Moravec, Klopcic, et al., 1999
Moravec, V.D.; Klopcic, S.A.; Jarrold, C.C., Anion photoelectron spectroscopy of small tin clusters, J. Chem. Phys., 1999, 110, 11, 5079-5088, https://doi.org/10.1063/1.478405 . [all data]

Negishi, Kawamata, et al., 2000
Negishi, Y.; Kawamata, H.; Nakajima, A.; Kaya, K., Photoelectron spectroscopy of tin and lead cluster anions: application of halogen-doping method, J. Electron Spectros. Rel. Phenom., 2000, 106, 2-3, 117-125, https://doi.org/10.1016/S0368-2048(99)00070-5 . [all data]

Ganteför, Gausa, et al., 1989
Ganteför, G.; Gausa, M.; Meiwes-Broer, K.H.; Lutz, H.O., Photoemission from Tin and Lead Clusters Anions, Z. Phys. D, 1989, 14, 1-4, 405, https://doi.org/10.1007/BF01426983 . [all data]