pOMe-phenide anion

Reaction thermochemistry data

Data compiled by: John E. Bartmess

Individual Reactions

C7H7O- + Hydrogen cation = Anisole

By formula: C7H7O- + H+ = C7H8O

Quantity Value Units Method Reference Comment
Δr1681. ± 13.kJ/molG+TSDahlke and Kass, 1992gas phase; Acid: anisole. Between o-OMe-phenide and Me2NH.
Quantity Value Units Method Reference Comment
Δr1648. ± 13.kJ/molIMRBDahlke and Kass, 1992gas phase; Acid: anisole. Between o-OMe-phenide and Me2NH.

References

Dahlke and Kass, 1992
Dahlke, G.D.; Kass, S.R., The Ortho-dehydrophenoxy Anion, Int. J. Mass Spectrom. Ion Proc., 1992, 117, 633, https://doi.org/10.1016/0168-1176(92)80117-J . [all data]