oOMe-phenide anion

Reaction thermochemistry data

Data compiled by: John E. Bartmess

Individual Reactions

C7H7O- + Hydrogen cation = Anisole

By formula: C7H7O- + H+ = C7H8O

Quantity Value Units Method Reference Comment
Δr1666. ± 13.kJ/molG+TSDahlke and Kass, 1992gas phase; Acid: anisole. Between HO- and m,p-methoxyphenide
Quantity Value Units Method Reference Comment
Δr1636. ± 13.kJ/molIMRBDahlke and Kass, 1992gas phase; Acid: anisole. Between HO- and m,p-methoxyphenide

Gas phase ion energetics data

Data compiled by: John E. Bartmess

Electron affinity of neutral species

EAneutral (eV) Method Reference Comment
1.25 ± 0.19D-EADahlke and Kass, 1992Acid: anisole. Between HO- and m,p-methoxyphenide

Protonation reactions

C7H7O- + Hydrogen cation = Anisole

By formula: C7H7O- + H+ = C7H8O

Quantity Value Units Method Reference Comment
Δr398.3 ± 3.1kcal/molG+TSDahlke and Kass, 1992gas phase; Acid: anisole. Between HO- and m,p-methoxyphenide
Quantity Value Units Method Reference Comment
Δr391.0 ± 3.0kcal/molIMRBDahlke and Kass, 1992gas phase; Acid: anisole. Between HO- and m,p-methoxyphenide

References

Dahlke and Kass, 1992
Dahlke, G.D.; Kass, S.R., The Ortho-dehydrophenoxy Anion, Int. J. Mass Spectrom. Ion Proc., 1992, 117, 633, https://doi.org/10.1016/0168-1176(92)80117-J . [all data]