(KI)13 radical anion

Gas phase ion energetics data

Data compiled by: John E. Bartmess

Electron affinity of neutral species

EAneutral (eV) Method Reference Comment
1.60 ± 0.10LPESYang, Bloomfield, et al., 1992EA given is Vertical Detachment Energy. Adiabatic EA est as up to 1 eV smaller

References

Yang, Bloomfield, et al., 1992
Yang, Y.A.; Bloomfield, L.A.; Jin, C.; Wang, L.S.; Smalley, R.E., Ultraviolet Photoelectron Spectroscopy and Photofragmentation Studies of Excess Electrons in Potassium Iodide Cluster Anions, J. Chem. Phys., 1992, 96, 4, 2453, https://doi.org/10.1063/1.462049 . [all data]