C6F6..C6F6 radical anion

Gas phase thermochemistry data

Data compiled by: John E. Bartmess

Quantity Value Units Method Reference Comment
Δfgas-474.8 ± 3.2kcal/molTherHiraoka, Mizuse, et al., 1990

Gas phase ion energetics data

Data compiled by: John E. Bartmess

Electron affinity of neutral species

EAneutral (eV) Method Reference Comment
0.93 ± 0.10LPESNakajima, Taguwa, et al., 1993Vertical Detachment Energy: 1.760±0.040 eV

References

Hiraoka, Mizuse, et al., 1990
Hiraoka, K.; Mizuse, S.; Yamabe, S., Stabilities and Structures of C6F6-(C6F6) and C6F6+(C6F6), J. Phys. Chem., 1990, 94, 9, 3689, https://doi.org/10.1021/j100372a061 . [all data]

Nakajima, Taguwa, et al., 1993
Nakajima, A.; Taguwa, T.; Hoshino, K.; Sugioka, T.; Naganuma, T.; Ono, F.; Watanabe, K.; Nakao, K., Photoelectron Spectroscopy of (C6F6)n- and (Au-C6F6)- Clusters, Chem. Phys. Lett., 1993, 214, 1, 22, https://doi.org/10.1016/0009-2614(93)85449-X . [all data]