methylenecyclobutan-2-ide anion

Reaction thermochemistry data

Data compiled by: John E. Bartmess

Individual Reactions

C5H7- + Hydrogen cation = Cyclobutane, methylene-

By formula: C5H7- + H+ = C5H8

Quantity Value Units Method Reference Comment
Δr1620. ± 21.kJ/molG+TSGuo and Kass, 1992gas phase; Between H2O, MeOH
Quantity Value Units Method Reference Comment
Δr1586. ± 21.kJ/molIMRBGuo and Kass, 1992gas phase; Between H2O, MeOH

Gas phase ion energetics data

Data compiled by: John E. Bartmess

Protonation reactions

C5H7- + Hydrogen cation = Cyclobutane, methylene-

By formula: C5H7- + H+ = C5H8

Quantity Value Units Method Reference Comment
Δr1620. ± 21.kJ/molG+TSGuo and Kass, 1992gas phase; Between H2O, MeOH
Quantity Value Units Method Reference Comment
Δr1586. ± 21.kJ/molIMRBGuo and Kass, 1992gas phase; Between H2O, MeOH

References

Guo and Kass, 1992
Guo, H.Z.; Kass, S.R., Vinylcyclopropyl Anion - Structure, Reactivity, Thermodynamic Properties, and an Unusual Rearrangement, J. Am. Chem. Soc., 1992, 114, 4, 1244, https://doi.org/10.1021/ja00030a019 . [all data]