CH2=CF anion

Reaction thermochemistry data

Data compiled by: John E. Bartmess

Individual Reactions

C2H2F- + Hydrogen cation = Ethene, fluoro-

By formula: C2H2F- + H+ = C2H3F

Quantity Value Units Method Reference Comment
Δr1618. ± 17.kJ/molG+TSRabasco and Kass, 1992gas phase; Comparable to PhF. Vinyl anion structure proved, rxn with D2O -> more stable HC≡CH..F-
Quantity Value Units Method Reference Comment
Δr1586. ± 17.kJ/molIMRBRabasco and Kass, 1992gas phase; Comparable to PhF. Vinyl anion structure proved, rxn with D2O -> more stable HC≡CH..F-

References

Rabasco and Kass, 1992
Rabasco, J.J.; Kass, S.R., Reactions of Strong Bases with Vinyl Fluoride Formation and Characterization of 1-Fluorovinyl Anion and the Fluoride-Acetylene Hydrogen-Bond, J. Am. Soc. Mass Spectrom., 1992, 3, 2, 91, https://doi.org/10.1016/1044-0305(92)87041-V . [all data]