CH2=CHCH(NMe2) anion

Reaction thermochemistry data

Data compiled by: John E. Bartmess

Individual Reactions

C5H10N- + Hydrogen cation = N-Allyl-N,N-dimethylamine

By formula: C5H10N- + H+ = C5H11N

Quantity Value Units Method Reference Comment
Δr1626. ± 17.kJ/molG+TSDahlke and Kass, 1991gas phase; Between H2O, furan. Reprotonation site uncertain
Quantity Value Units Method Reference Comment
Δr1598. ± 17.kJ/molIMRBDahlke and Kass, 1991gas phase; Between H2O, furan. Reprotonation site uncertain

Gas phase ion energetics data

Data compiled by: John E. Bartmess

Electron affinity of neutral species

EAneutral (eV) Method Reference Comment
0.22 ± 0.25D-EADahlke and Kass, 1991Between H2O, furan. Reprotonation site uncertain

Protonation reactions

C5H10N- + Hydrogen cation = N-Allyl-N,N-dimethylamine

By formula: C5H10N- + H+ = C5H11N

Quantity Value Units Method Reference Comment
Δr1626. ± 17.kJ/molG+TSDahlke and Kass, 1991gas phase; Between H2O, furan. Reprotonation site uncertain
Quantity Value Units Method Reference Comment
Δr1598. ± 17.kJ/molIMRBDahlke and Kass, 1991gas phase; Between H2O, furan. Reprotonation site uncertain

References

Dahlke and Kass, 1991
Dahlke, G.D.; Kass, S.R., Substituent Effects in the Gas Phase - 1-Substituted Allyl Anions, J. Am. Chem. Soc., 1991, 113, 15, 5566, https://doi.org/10.1021/ja00015a008 . [all data]