CH2=CHCH(SMe) anion

Reaction thermochemistry data

Data compiled by: John E. Bartmess

Individual Reactions

C4H7S- + Hydrogen cation = Sulfide, allyl methyl

By formula: C4H7S- + H+ = C4H8S

Quantity Value Units Method Reference Comment
Δr1563. ± 17.kJ/molG+TSDahlke and Kass, 1991gas phase; Between iPrOH, MeCN. Reprotonation site uncertain.
Quantity Value Units Method Reference Comment
Δr1536. ± 17.kJ/molIMRBDahlke and Kass, 1991gas phase; Between iPrOH, MeCN. Reprotonation site uncertain.

Gas phase ion energetics data

Data compiled by: John E. Bartmess

Electron affinity of neutral species

EAneutral (eV) Method Reference Comment
1.04 ± 0.22D-EADahlke and Kass, 1991Between iPrOH, MeCN. Reprotonation site uncertain.

Protonation reactions

C4H7S- + Hydrogen cation = Sulfide, allyl methyl

By formula: C4H7S- + H+ = C4H8S

Quantity Value Units Method Reference Comment
Δr1563. ± 17.kJ/molG+TSDahlke and Kass, 1991gas phase; Between iPrOH, MeCN. Reprotonation site uncertain.
Quantity Value Units Method Reference Comment
Δr1536. ± 17.kJ/molIMRBDahlke and Kass, 1991gas phase; Between iPrOH, MeCN. Reprotonation site uncertain.

References

Dahlke and Kass, 1991
Dahlke, G.D.; Kass, S.R., Substituent Effects in the Gas Phase - 1-Substituted Allyl Anions, J. Am. Chem. Soc., 1991, 113, 15, 5566, https://doi.org/10.1021/ja00015a008 . [all data]