CH2=CHCHCl anion

Gas phase ion energetics data

Data compiled by: John E. Bartmess

Electron affinity of neutral species

EAneutral (eV) Method Reference Comment
0.97 ± 0.19D-EADahlke and Kass, 1991Between MeOH, EtOH. Reprotonation site uncertain

Protonation reactions

C3H4Cl- + Hydrogen cation = Allyl chloride

By formula: C3H4Cl- + H+ = C3H5Cl

Quantity Value Units Method Reference Comment
Δr1590. ± 17.kJ/molG+TSDahlke and Kass, 1991gas phase; Between MeOH, EtOH. Reprotonation site uncertain
Δr1571. ± 8.8kJ/molG+TSPoutsma, Nash, et al., 1997gas phase; Between iPrOH, HF, near tBuOH
Quantity Value Units Method Reference Comment
Δr1559. ± 17.kJ/molIMRBDahlke and Kass, 1991gas phase; Between MeOH, EtOH. Reprotonation site uncertain
Δr1540. ± 8.4kJ/molIMRBPoutsma, Nash, et al., 1997gas phase; Between iPrOH, HF, near tBuOH

References

Dahlke and Kass, 1991
Dahlke, G.D.; Kass, S.R., Substituent Effects in the Gas Phase - 1-Substituted Allyl Anions, J. Am. Chem. Soc., 1991, 113, 15, 5566, https://doi.org/10.1021/ja00015a008 . [all data]

Poutsma, Nash, et al., 1997
Poutsma, J.C.; Nash, J.J.; Paulino, J.A.; Squires, R.R., Absolute Heats of Formation of Phenylcarbene and Vinylcarbene, J. Am. Chem. Soc., 1997, 119, 20, 4686, https://doi.org/10.1021/ja963918s . [all data]