(CO)3Fe-butadienide anion

Reaction thermochemistry data

Data compiled by: John E. Bartmess

Individual Reactions

C7H5FeO3- + Hydrogen cation = Iron, (1,3-butadiene)tricarbonyl-

By formula: C7H5FeO3- + H+ = C7H6FeO3

Quantity Value Units Method Reference Comment
Δr340.0 ± 5.0kcal/molIMRBWang and Squires, 1987gas phase; Butadiene-Fe(CO)3 deprotonated by PhO-, not by N3-

Gas phase ion energetics data

Data compiled by: John E. Bartmess

Protonation reactions

C7H5FeO3- + Hydrogen cation = Iron, (1,3-butadiene)tricarbonyl-

By formula: C7H5FeO3- + H+ = C7H6FeO3

Quantity Value Units Method Reference Comment
Δr340.0 ± 5.0kcal/molIMRBWang and Squires, 1987gas phase; Butadiene-Fe(CO)3 deprotonated by PhO-, not by N3-

References

Wang and Squires, 1987
Wang, D.N.; Squires, R.R., Gas Phase Ion Chemistry of Two Isomeric (C4H6)Fe(CO)3 Complexes, Organomet., 1987, 6, 5, 905, https://doi.org/10.1021/om00148a001 . [all data]