MeSO2CH2COCH=NO anion

Reaction thermochemistry data

Data compiled by: John E. Bartmess

Individual Reactions

C4H6NO4S- + Hydrogen cation = C4H7NO4S

By formula: C4H6NO4S- + H+ = C4H7NO4S

Quantity Value Units Method Reference Comment
Δr330.0 ± 2.1kcal/molG+TSBouchoux, Jaudon, et al., 1991gas phase; AM1 implies oximate anion (authors), may be carbanion by struct/react.-JEB
Quantity Value Units Method Reference Comment
Δr323.4 ± 2.0kcal/molIMREBouchoux, Jaudon, et al., 1991gas phase; AM1 implies oximate anion (authors), may be carbanion by struct/react.-JEB

References

Bouchoux, Jaudon, et al., 1991
Bouchoux, G.; Jaudon, P.; Decouzon, M.; Gal, J.-F.; Maria, P.-C., Gas-Phase Acidity of Some alpha-keto Aldoximes: Experiment and Theory, J. Phys. Org. Chem., 1991, 4, 5, 285, https://doi.org/10.1002/poc.610040505 . [all data]