MeSOCH2COCH=NO anion

Reaction thermochemistry data

Data compiled by: John E. Bartmess

Individual Reactions

C4H6NO3S- + Hydrogen cation = C4H7NO3S

By formula: C4H6NO3S- + H+ = C4H7NO3S

Quantity Value Units Method Reference Comment
Δr331.6 ± 3.1kcal/molG+TSBouchoux, Jaudon, et al., 1991gas phase
Quantity Value Units Method Reference Comment
Δr325.0 ± 3.0kcal/molIMREBouchoux, Jaudon, et al., 1991gas phase

References

Bouchoux, Jaudon, et al., 1991
Bouchoux, G.; Jaudon, P.; Decouzon, M.; Gal, J.-F.; Maria, P.-C., Gas-Phase Acidity of Some alpha-keto Aldoximes: Experiment and Theory, J. Phys. Org. Chem., 1991, 4, 5, 285, https://doi.org/10.1002/poc.610040505 . [all data]