P4O10 radical anion

Gas phase thermochemistry data

Data compiled by: John E. Bartmess

Quantity Value Units Method Reference Comment
Δfgas-752.5 ± 5.7kcal/molR-EAMavrin, Korobov, et al., 1991Adjusted to current value of EA(PO2-) from that used in ref.; value altered from reference due to change in acidity scale

References

Mavrin, Korobov, et al., 1991
Mavrin, A.A.; Korobov, M.V.; Andreeva, T.E.; Sidorov, L.N., The Electron Affinity of P4O10, Zh. Fiz. Khim. SSSR, 1991, 65, 1711. [all data]