Trichloroethylene anion

Gas phase thermochemistry data

Data compiled by: John E. Bartmess

Quantity Value Units Method Reference Comment
Δfgas-8.86kcal/molR-EAWiley, Chen, et al., 1991

References

Wiley, Chen, et al., 1991
Wiley, J.R.; Chen, E.C.M.; Chen, E.S.D.; Richardson, P.; Reed, W.R.; Wentworth, W.E., The Determination of Absolute Electron Affinities of Chlorobenzenes, Chloronaphthalenes and Chlorinated Biphenyls from Reduction Potentials, J. Electroanal. Chem. Interfac., 1991, 307, 1-2, 169, https://doi.org/10.1016/0022-0728(91)85546-2 . [all data]