ONPF2 radical anion

Gas phase thermochemistry data

Data compiled by: John E. Bartmess

Quantity Value Units Method Reference Comment
Δfgas<-581.58kJ/molIMRBSullivan and Beauchamp, 1978HNO- + PF3 -> NOPF2- + HF. Computations put HOF(A-) at ca. -151 kcal/mol

References

Sullivan and Beauchamp, 1978
Sullivan, S.A.; Beauchamp, J.L., Nucleophilic Reactions of Anions with PF3 and OPF3 in the Gas Phase by ICR Spectroscopy, Inorg. Chem., 1978, 17, 6, 1589, https://doi.org/10.1021/ic50184a039 . [all data]